{"text_format":"1","workbook":"xlsx","n_sheets":27,"sheets":["Cover","Credits-Deficits -->","Cred-Def Summary","Credits Generated","Fuel Consumption + Conversions","CI Targets and Inputs","Availability + Consumption -->","Summary Table ","Gasoline + Alts Forecast","Petroleum Availability","Ethanol Availability","Diesel + Alts Cons Forecast","Biodiesel Availability","Renewable Diesel Availability","Electricity Cons Forecast","Electricity Availability","Natural Gas + RNG Forecast","Natural Gas Availability","Renew Natural Gas Availability","Propane Consumption Forecast","Propane Availability","Data Sources-->","Gas & Diesel Forecast Data","Vehicle Stock Forecast","CNG Vehicle Registrations","Washington EV Data","Propane EIA Data"],"not_rendered":{"charts":0,"images":2,"macros":0,"external_links":0,"defined_names":27,"comments":2,"pivot_tables":0},"unopened":[],"bounds":{"document_bytes":16777216,"sheet_cells":100000,"rows_first":2000,"rows_last":500,"rows_between":2000,"halvings":0,"cell_chars":16384,"cell_head_chars":4096},"cells_cut":0,"cells_raw":0,"read":"whole","date_system":"1900"}

{"sheet":"Cover","index":0,"n_rows":9,"n_cols":4,"rows_kept":9,"cut":false,"hidden":false,"merged":[]}
[]
[]
[]
[]
[]
[]
[null,null,null,"Draft Clean Fuel Supply Forecast"]
[null,null,null,"BRG Work Product for the Washington State Department of Commerce"]
{"$rows_left_out":2}
{"sheet":"Credits-Deficits -->","index":1,"n_rows":0,"n_cols":0,"rows_kept":0,"cut":false,"hidden":false,"merged":[]}

{"sheet":"Cred-Def Summary","index":2,"n_rows":6,"n_cols":8,"rows_kept":6,"cut":false,"hidden":false,"merged":[]}
[]
[null,"Credits/Deficits/Bank Balance Summary Table"]
[]
[null,"Year","Fueling Related Credit Generation","Fueling Related Deficit Generation","Non-Fueling Capacity and Infrastructure Credits","Net Credit Generation","Bank Beginning Balance","Bank Ending Balance"]
[null,2023,{"$f":"SUMIF('Credits Generated'!$C6:$K6,\">0\")","v":1132779.1004977587},{"$f":"SUMIF('Credits Generated'!$C6:$K6,\"<0\")","v":-511620.39386572182},{"$f":"C5*(1/19)","v":59619.952657776768},{"$f":"SUM(C5:E5)","v":680778.65928981372},0,{"$f":"G5+F5","v":680778.65928981372}]
[null,2024,{"$f":"SUMIF('Credits Generated'!$C7:$K7,\">0\")","v":1289305.2925320109},{"$f":"SUMIF('Credits Generated'!$C7:$K7,\"<0\")","v":-725973.83589432284},{"$f":"C6*(1/19)","v":67858.17329115847},{"$f":"SUM(C6:E6)","v":631189.62992884661},{"$f":"H5","v":680778.65928981372},{"$f":"G6+F6","v":1311968.2892186604}]

{"sheet":"Credits Generated","index":3,"n_rows":12,"n_cols":12,"rows_kept":12,"cut":false,"hidden":false,"merged":[]}
[]
[null,"Credits Generation"]
[]
[null,"Credits Generated by Fuel Type"]
[null,"Year","Gasoline","Ethanol","Electricity","Diesel","Biodiesel","Renewable Diesel","Natural Gas","RNG","Propane","Total"]
[null,2023,{"$f":"(C11*'Fuel Consumption + Conversions'!C5)/(10^6)","v":-432009.35486521234},{"$f":"(D11*'Fuel Consumption + Conversions'!D5)/(10^6)","v":612841.50615928753},{"$f":"(E11*'Fuel Consumption + Conversions'!G5)/(10^6)","v":58629.673080015469},{"$f":"(F11*'Fuel Consumption + Conversions'!H5)/(10^6)","v":-79611.039000509467},{"$f":"(G11*'Fuel Consumption + Conversions'!I5)/(10^6)","v":243690.91138958541},{"$f":"(H11*'Fuel Consumption + Conversions'!J5)/(10^6)","v":211381.77937670477},{"$f":"(I11*'Fuel Consumption + Conversions'!K5)/(10^6)","v":60.392266250851875},{"$f":"(J11*'Fuel Consumption + Conversions'!L5)/(10^6)","v":358.49601401460319},{"$f":"(K11*'Fuel Consumption + Conversions'!M5)/(10^6)","v":5816.3422119000006},{"$f":"SUM(C6:K6)","v":621158.70663203683}]
[null,2024,{"$f":"(C12*'Fuel Consumption + Conversions'!C6)/(10^6)","v":-596262.76441498718},{"$f":"(D12*'Fuel Consumption + Conversions'!D6)/(10^6)","v":610577.25629149145},{"$f":"(E12*'Fuel Consumption + Conversions'!G6)/(10^6)","v":73103.805113086055},{"$f":"(F12*'Fuel Consumption + Conversions'!H6)/(10^6)","v":-129711.07147933566},{"$f":"(G12*'Fuel Consumption + Conversions'!I6)/(10^6)","v":288961.3271134547},{"$f":"(H12*'Fuel Consumption + Conversions'!J6)/(10^6)","v":310387.26014788024},{"$f":"(I12*'Fuel Consumption + Conversions'!K6)/(10^6)","v":34.921040344321284},{"$f":"(J12*'Fuel Consumption + Conversions'!L6)/(10^6)","v":392.15191118747452},{"$f":"(K12*'Fuel Consumption + Conversions'!M6)/(10^6)","v":5848.5709145666679},{"$f":"SUM(C7:K7)","v":563331.45663768798}]
[]
{"$rows_left_out":5}
{"sheet":"Fuel Consumption + Conversions","index":4,"n_rows":22,"n_cols":13,"rows_kept":22,"cut":false,"hidden":false,"merged":[]}
[]
[null,"Energy Consumption per Fuel (MJ)"]
[]
[null,"Year","Gasoline","Ethanol","Electricity (BEV)","Electricity (PHEV)","Total Electricity","Diesel","Biodiesel","Renewable Diesel","Natural Gas","Renewable Natural Gas (Landfill)","Propane"]
[null,2023,{"$f":"(('Summary Table '!H$5*(10^6))*$E$10)/(10^6)*$G$10","v":311279572623.27502},{"$f":"(('Summary Table '!H6*(10^6))*$E$11)/(10^6)*$G$11","v":23641615612.875004},{"$f":"('Summary Table '!H15*'Fuel Consumption + Conversions'!$E$18)/(10^6)*'Fuel Consumption + Conversions'!$G$18","v":625910253.65075159},{"$f":"('Summary Table '!H16*'Fuel Consumption + Conversions'!$E$18)/(10^6)*'Fuel Consumption + Conversions'!$G$18","v":92810035.036177129},{"$f":"SUM(Table812[[#This Row],[Electricity (BEV)]:[Electricity (PHEV)]])","v":718720288.68692875},{"$f":"('Summary Table '!H9*(10^6))*$E$12/(10^6)*$G$12","v":104121160084.37},{"$f":"(('Summary Table '!H$10*(10^6)*'Fuel Consumption + Conversions'!$E$13/(10^6))*'Fuel Consumption + Conversions'!$G$13)","v":5405095915.5199995},{"$f":"(('Summary Table '!H12*(10^6))*'Fuel Consumption + Conversions'!$E$14/(10^6))*'Fuel Consumption + Conversions'!$G$14","v":4284586308.75},{"$f":"('Summary Table '!H18*(10^6))*'Fuel Consumption + Conversions'!$E$12/(10^6)*'Fuel Consumption + Conversions'!$G$12","v":2676321.5476283091},{"$f":"('Summary Table '!H19*(10^6))*'Fuel Consumption + Conversions'!$E$12/(10^6)*'Fuel Consumption + Conversions'!$G$12","v":9987241.0953660663},{"$f":"('Summary Table '!H22*(10^6)*'Fuel Consumption + Conversions'!$E$17)/(10^6)*$G$17","v":239302468.25396824}]
[null,2024,{"$f":"(('Summary Table '!I$5*(10^6))*$E$10)/(10^6)*$G$10","v":316202346298.45001},{"$f":"(('Summary Table '!I6*(10^6))*$E$11)/(10^6)*$G$11","v":24015499199.25},{"$f":"('Summary Table '!I15*'Fuel Consumption + Conversions'!$E$18)/(10^6)*'Fuel Consumption + Conversions'!$G$18","v":796379644.11895132},{"$f":"('Summary Table '!I16*'Fuel Consumption + Conversions'!$E$18)/(10^6)*'Fuel Consumption + Conversions'!$G$18","v":105276653.65726741},{"$f":"SUM(Table812[[#This Row],[Electricity (BEV)]:[Electricity (PHEV)]])","v":901656297.77621877},{"$f":"('Summary Table '!I9*(10^6))*$E$12/(10^6)*$G$12","v":102199079325.035},{"$f":"(('Summary Table '!I$10*(10^6)*'Fuel Consumption + Conversions'!$E$13/(10^6))*'Fuel Consumption + Conversions'!$G$13)","v":6481743869.8600006},{"$f":"(('Summary Table '!I12*(10^6))*'Fuel Consumption + Conversions'!$E$14/(10^6))*'Fuel Consumption + Conversions'!$G$14","v":6356382859.75},{"$f":"('Summary Table '!I18*(10^6))*'Fuel Consumption + Conversions'!$E$12/(10^6)*'Fuel Consumption + Conversions'!$G$12","v":1582945.3303742965},{"$f":"('Summary Table '!I19*(10^6))*'Fuel Consumption + Conversions'!$E$12/(10^6)*'Fuel Consumption + Conversions'!$G$12","v":11080617.312620075},{"$f":"('Summary Table '!I22*(10^6)*'Fuel Consumption + Conversions'!$E$17)/(10^6)*$G$17","v":245730013.88888896}]
[]
[null,null,"Conversion Units"]
{"$rows_left_out":15}
{"sheet":"CI Targets and Inputs","index":5,"n_rows":27,"n_cols":5,"rows_kept":27,"cut":false,"hidden":false,"merged":[]}
[]
[null,"CI Targets and Factor Inputs"]
[]
[null,"CI Targets"]
[null,"Year","Gasoline","Diesel","CI Target % Reduction"]
[null,null,null,null,"[1]"]
[null,2023,{"$f":"D13*(1-Table7[[#This Row],[CI Target % Reduction]])","v":99.072149999999993},{"$f":"D15*(1-Table7[[#This Row],[CI Target % Reduction]])","v":100.41540000000001},5.0000000000000001E-3]
[null,2024,{"$f":"D13*(1-Table7[[#This Row],[CI Target % Reduction]])","v":98.574299999999994},{"$f":"D15*(1-Table7[[#This Row],[CI Target % Reduction]])","v":99.910799999999995},0.01]
{"$rows_left_out":20}
{"sheet":"Availability + Consumption -->","index":6,"n_rows":0,"n_cols":0,"rows_kept":0,"cut":false,"hidden":false,"merged":[]}

{"sheet":"Summary Table ","index":7,"n_rows":40,"n_cols":9,"rows_kept":40,"cut":false,"hidden":false,"merged":[]}
[]
[null,null,"Summary Table of Fuel Consumption Forecasts"]
[]
[null,null,"Fuel Type","Unit","Citation Reference","2021","2022","2023","2024"]
[null,null,"Fossil Gasoline","MM Gallons","[1]",{"$f":"'Gas & Diesel Forecast Data'!K$6-F$6","v":2250.835},{"$f":"'Gas & Diesel Forecast Data'!L$6-G$6","v":2399.7474999999999},{"$f":"'Gas & Diesel Forecast Data'!M$6-H$6","v":2453.8975},{"$f":"'Gas & Diesel Forecast Data'!N$6-I$6","v":2492.7049999999999}]
[null,null,"Ethanol","MM Gallons","[2]",{"$f":"'Gas & Diesel Forecast Data'!K$6*'Summary Table '!F$7","v":243.16500000000002},{"$f":"'Gas & Diesel Forecast Data'!L$6*'Summary Table '!G$7","v":259.2525},{"$f":"'Gas & Diesel Forecast Data'!M$6*'Summary Table '!H$7","v":265.10250000000002},{"$f":"'Gas & Diesel Forecast Data'!N$6*'Summary Table '!I$7","v":269.29500000000002}]
[null,null,"Ethanol Blend Rate","%","[3]",9.7500000000000003E-2,9.7500000000000003E-2,9.7500000000000003E-2,9.7500000000000003E-2]
[null,null,"Total Gasoline","MM Gallons","[4]",{"$f":"SUM(F5:F6)","v":2494},{"$f":"SUM(G5:G6)","v":2659},{"$f":"SUM(H5:H6)","v":2719},2762]
{"$rows_left_out":33}
{"sheet":"Gasoline + Alts Forecast","index":8,"n_rows":13,"n_cols":8,"rows_kept":13,"cut":false,"hidden":false,"merged":[]}
[]
[null,"Gasoline and Gasoline Alternatives Consumption Forecast"]
[]
[null,"Fuel Type","Unit","Citation Reference","2021","2022","2023","2024"]
[null,"Fossil Gasoline","MM Gallons","[1]",{"$f":"'Gas & Diesel Forecast Data'!K$6-E6","v":2250.835},{"$f":"'Gas & Diesel Forecast Data'!L$6-F6","v":2399.7474999999999},{"$f":"'Gas & Diesel Forecast Data'!M$6-G6","v":2453.8975},{"$f":"'Gas & Diesel Forecast Data'!N$6-H6","v":2492.7049999999999}]
[null,"Ethanol","MM Gallons","[2]",{"$f":"'Gas & Diesel Forecast Data'!K$6*E$7","v":243.16500000000002},{"$f":"'Gas & Diesel Forecast Data'!L$6*'Summary Table '!G$7","v":259.2525},{"$f":"'Gas & Diesel Forecast Data'!M$6*'Summary Table '!H$7","v":265.10250000000002},{"$f":"'Gas & Diesel Forecast Data'!N$6*'Summary Table '!I$7","v":269.29500000000002}]
[null,"Ethanol Blend Rate","%","[3]",9.7500000000000003E-2,9.7500000000000003E-2,9.7500000000000003E-2,9.7500000000000003E-2]
[null,"Total Gasoline","MM Gallons","[4]",{"$f":"SUM(E5:E6)","v":2494},{"$f":"SUM(F5:F6)","v":2659},{"$f":"SUM(G5:G6)","v":2719},{"$f":"SUM(H5:H6)","v":2762}]
{"$rows_left_out":6}
{"sheet":"Petroleum Availability","index":9,"n_rows":68,"n_cols":5,"rows_kept":68,"cut":false,"hidden":false,"merged":[[6,2,7,2]]}
[]
[null,"Petroleum Production and Available Capacity (2022)"]
[]
[null,"Conversion:","Barrels to Gallons",42]
[]
[null,"Product",null,"Gallons (EIA)","% of barrel"]
[null,"Finished motor gasoline","[1]",19.399999999999999,{"$f":"D7/D4","v":0.46190476190476187}]
[null,"Distillate fuel oil",null,13.44,{"$f":"D8/D4","v":0.32}]
{"$rows_left_out":61}
{"sheet":"Ethanol Availability","index":10,"n_rows":42,"n_cols":5,"rows_kept":42,"cut":false,"hidden":false,"merged":[[3,3,3,4],[5,3,5,4]]}
[]
[null,"Ethanol Production (2022)"]
[]
[null,"State","Number of Producers","Production Capacity"]
[null,null,null," (MM gal/year)"," (Thousand Barrels/day)"]
[null,null,"[1]","[2]"]
[null,"East Coast (PADD 1)"]
[null,"New York",2,62,4.0443574690149999]
{"$rows_left_out":35}
{"sheet":"Diesel + Alts Cons Forecast","index":11,"n_rows":17,"n_cols":8,"rows_kept":17,"cut":false,"hidden":false,"merged":[]}
[]
[null,"Diesel and Diesel Alternatives Volume Consumption Forecast"]
[]
[null,"Fuel Type","Unit","Citation Reference","2021","2022","2023","2024"]
[null,"Fossil Diesel","MM Gallons","[1]",{"$f":"'Gas & Diesel Forecast Data'!K$10-SUM(E$6,E$8)","v":707.85},{"$f":"'Gas & Diesel Forecast Data'!L$10-SUM(F$6,F$8)","v":757.57500000000005},{"$f":"'Gas & Diesel Forecast Data'!M$10-SUM(G$6,G$8)","v":712.63660000000004},{"$f":"'Gas & Diesel Forecast Data'!N$10-SUM(H$6,H$8)","v":699.48130000000003}]
[null,"Biodiesel","MM Gallons","[2]",{"$f":"'Gas & Diesel Forecast Data'!K$10*E$7","v":18.150000000000002},{"$f":"'Gas & Diesel Forecast Data'!L$10*F$7","v":19.425000000000001},{"$f":"'Gas & Diesel Forecast Data'!M$10*G$7","v":40.038400000000003},{"$f":"'Gas & Diesel Forecast Data'!N$10*H$7","v":48.0137}]
[null,"Biodiesel Blend Rate","%","[3]",2.5000000000000001E-2,2.5000000000000001E-2,5.1200000000000002E-2,{"$f":"G7+0.0095","v":6.0700000000000004E-2}]
[null,"Renewable Diesel","MM Gallons","[4]",{"$f":"'Gas & Diesel Forecast Data'!K$10*E$9","v":0},{"$f":"'Gas & Diesel Forecast Data'!L$10*F$9","v":0},{"$f":"'Gas & Diesel Forecast Data'!M$10*G$9","v":29.324999999999999},{"$f":"'Gas & Diesel Forecast Data'!N$10*H$9","v":43.505000000000003}]
{"$rows_left_out":10}
{"sheet":"Biodiesel Availability","index":12,"n_rows":52,"n_cols":5,"rows_kept":52,"cut":false,"hidden":false,"merged":[[3,3,3,4],[5,3,5,4]]}
[]
[null,"Biodiesel Production (2022)"]
[]
[null,"State","Number of Producers","Production Capacity"]
[null,null,null," (MM gal/year)"," (Thousand Barrels/day)"]
[null,null,"[1]","[2]"]
[null,"East Coast PADD 1"]
[null,"Connecticut",1,35,2.2831050228310503]
{"$rows_left_out":45}
{"sheet":"Renewable Diesel Availability","index":13,"n_rows":26,"n_cols":5,"rows_kept":26,"cut":false,"hidden":false,"merged":[[3,3,3,4],[5,3,5,4]]}
[]
[null,"Renewable Diesel Availability (2023)"]
[]
[null,"State","Number of Producers","Production Capacity"]
[null,null,null," (MM gal/year)"," (Thousand Barrels/day)"]
[null,null,null,"[1]"]
[null,"Midwest (PADD 2)"]
[null,"Kansas",1,3,0]
{"$rows_left_out":19}
{"sheet":"Electricity Cons Forecast","index":14,"n_rows":11,"n_cols":8,"rows_kept":11,"cut":false,"hidden":false,"merged":[]}
[]
[null,"Electricity Consumption Forecast"]
[]
[null,"Fuel Type","Unit","Citation Reference","2021","2022","2023","2024"]
[null,"Electricity (BEVs)","GWh","[1]",{"$f":"('Vehicle Stock Forecast'!K$39*'Washington EV Data'!$F$7)/1000000","v":102.91895715626545},{"$f":"('Vehicle Stock Forecast'!L$39*'Washington EV Data'!$F$7)/1000000","v":130.37438407578921},{"$f":"('Vehicle Stock Forecast'!M$39*'Washington EV Data'!$F$7)/1000000","v":173.88038138345053},{"$f":"('Vehicle Stock Forecast'!N$39*'Washington EV Data'!$F$7)/1000000","v":221.23746246005214}]
[null,"Electricity (PHEVs)","GWh","[2]",{"$f":"('Vehicle Stock Forecast'!K$40*'Washington EV Data'!$F$15)/1000000","v":19.903889104677063},{"$f":"('Vehicle Stock Forecast'!L$40*'Washington EV Data'!$F$15)/1000000","v":22.202788296267265},{"$f":"('Vehicle Stock Forecast'!M$40*'Washington EV Data'!$F$15)/1000000","v":25.783000348971051},{"$f":"('Vehicle Stock Forecast'!N$40*'Washington EV Data'!$F$15)/1000000","v":29.246277053184858}]
[null,"Electricity","MM Gallons Gasoline Equivalent","[3]",{"$f":"(E5/'Fuel Consumption + Conversions'!$E$19)+(E6/'Fuel Consumption + Conversions'!$E$19)","v":3.6445948445383531},{"$f":"(F5/'Fuel Consumption + Conversions'!$E$19)+(F6/'Fuel Consumption + Conversions'!$E$19)","v":4.527512533295444},{"$f":"(G5/'Fuel Consumption + Conversions'!$E$19)+(G6/'Fuel Consumption + Conversions'!$E$19)","v":5.9247294282617675},{"$f":"(H5/'Fuel Consumption + Conversions'!$E$19)+(H6/'Fuel Consumption + Conversions'!$E$19)","v":7.4327519143393763}]
[]
{"$rows_left_out":4}
{"sheet":"Electricity Availability","index":15,"n_rows":20,"n_cols":5,"rows_kept":20,"cut":false,"hidden":false,"merged":[]}
[]
[null,"Electricity Generation Availability (2020)"]
[]
[null,"Interconnection","State","Generation Available","Generation Available"]
[null,null,null,"(GWh/year)","MM GGE"]
[null,null,null,"[1]","[2]"]
[null,"WECC","AZ",109305.057,{"$f":"D7/'Fuel Consumption + Conversions'!$E$19","v":3243.4735014836792}]
[null,"WECC","CA",193074.93,{"$f":"D8/'Fuel Consumption + Conversions'!$E$19","v":5729.2264094955481}]
{"$rows_left_out":13}
{"sheet":"Natural Gas + RNG Forecast","index":16,"n_rows":13,"n_cols":8,"rows_kept":13,"cut":false,"hidden":false,"merged":[]}
[]
[null,"Natural Gas and Renewable Natural Gas Consumption Forecast"]
[]
[null,"Fuel Type","Unit","Citation Reference","2021","2022","2023","2024"]
[null,"Natural Gas","MM Diesel Gallons Equivalent","[1]",{"$f":"E8-E6","v":0.11498425381295413},{"$f":"F8-F6","v":0.11498425381295413},{"$f":"G8-G6","v":2.4300810505945111E-2},{"$f":"H8-H6","v":1.4373031726619273E-2}]
[null,"Renewable Natural Gas","MM Diesel Gallons Equivalent","[2]",{"$f":"E8*E7","v":0},{"$f":"F8*F7","v":0},{"$f":"G8*G7","v":9.0683443307009018E-2},{"$f":"H8*H7","v":0.10061122208633486}]
[null,"Renewable Natural Gas Blend Rate","%","[3]",0,0,0.78865966686642641,0.875]
[null,"Total Natural Gas","MM Diesel Gallons Equivalent","[4]",{"$f":"((('CNG Vehicle Registrations'!$F$7*'CNG Vehicle Registrations'!$F$8)*'Fuel Consumption + Conversions'!$E$15)/'Fuel Consumption + Conversions'!$E$10)/(10^6)","v":0.11498425381295413},{"$f":"((('CNG Vehicle Registrations'!$F$7*'CNG Vehicle Registrations'!$F$8)*'Fuel Consumption + Conversions'!$E$15)/'Fuel Consumption + Conversions'!$E$10)/(10^6)","v":0.11498425381295413},{"$f":"((('CNG Vehicle Registrations'!$F$7*'CNG Vehicle Registrations'!$F$8)*'Fuel Consumption + Conversions'!$E$15)/'Fuel Consumption + Conversions'!$E$10)/(10^6)","v":0.11498425381295413},{"$f":"((('CNG Vehicle Registrations'!$F$7*'CNG Vehicle Registrations'!$F$8)*'Fuel Consumption + Conversions'!$E$15)/'Fuel Consumption + Conversions'!$E$10)/(10^6)","v":0.11498425381295413}]
{"$rows_left_out":6}
{"sheet":"Natural Gas Availability","index":17,"n_rows":62,"n_cols":4,"rows_kept":62,"cut":false,"hidden":false,"merged":[[7,2,7,3]]}
[]
[null,"Natural Gas Production (2022)"]
[]
[null,"Conversion"]
[null,"cubic feet to Btu",1039]
[null,"cubic meter to cubic feet",35.335999999999999]
[]
[null,"State","Production Capacity"]
{"$rows_left_out":55}
{"sheet":"Renew Natural Gas Availability","index":18,"n_rows":51,"n_cols":13,"rows_kept":51,"cut":false,"hidden":false,"merged":[[3,3,3,12],[6,3,6,6]]}
[]
[null,"Renewable Natural Gas Production Availability (2022)"]
[]
[null,"State","Total Number of Producers","Production Volume (2021)"]
[null,null,null,"Food Waste","Landfills","Livestock","Water Treatment Facility","Total","Food Waste","Landfills","Livestock","Water Treatment Facility","Total"]
[null,null,null,"MMBtu/year","Mmbtu/year","MMBtu/year","MMBtu/year","MMBtu/year","MM DGE/year","MM DGE/year","MM DGE/year","MM DGE/year","MM DGE/year"]
[null,null,null,"[1]"]
[null,"East Coast (PADD 1)"]
{"$rows_left_out":44}
{"sheet":"Propane Consumption Forecast","index":19,"n_rows":8,"n_cols":8,"rows_kept":8,"cut":false,"hidden":false,"merged":[]}
[]
[null,"Propane Consumption Forecast"]
[]
[null,"Fuel Type","Unit","Citation Reference","2021","2022","2023","2024"]
[null,"Propane","MM Gallons","[1]",{"$f":"'Propane EIA Data'!F$5*'Propane EIA Data'!$F$9","v":1.9736442305355018},{"$f":"'Propane EIA Data'!G$5*'Propane EIA Data'!$F$9","v":2.2983129784158005},{"$f":"'Propane EIA Data'!H$5*'Propane EIA Data'!$F$9","v":2.4811527469589163},{"$f":"'Propane EIA Data'!I$5*'Propane EIA Data'!$F$9","v":2.547795279418557}]
[]
[null,"Sources and Notes:"]
[null,"[1]: 'Propane Consumption Forecast.' Using Washington's historical consumption BRG has allocated the projected propane consumption using the U.S. EIA AEO Pacific Consumption Forecast. Due to an identified data limitation BRG relied upon the average allocation to Washington from 2014 through 2019."]
{"$rows_left_out":1}
{"sheet":"Propane Availability","index":20,"n_rows":35,"n_cols":5,"rows_kept":35,"cut":false,"hidden":false,"merged":[[5,2,5,4]]}
[]
[null,"Propane Production Availability (2022)"]
[]
[null,"Conversion","Barrels to Gallons",42]
[]
[null,"PADD","Production Volume"]
[null,null,"Natural Gas Field Plant Production","Refinery Production","Total "]
[null,null,"Thousand barrels/year","Thousand barrels/year","MM gal/year"]
{"$rows_left_out":28}
{"sheet":"Data Sources-->","index":21,"n_rows":0,"n_cols":0,"rows_kept":0,"cut":false,"hidden":false,"merged":[]}

{"sheet":"Gas & Diesel Forecast Data","index":22,"n_rows":22,"n_cols":21,"rows_kept":22,"cut":false,"hidden":false,"merged":[[1,2,1,12],[2,2,2,10]]}
[]
[null,null,"Transportation Revenue Forecast Council\nTable A. 1. Washington Motor Fuel Consumption Fiscal Year Forecast June 2022"]
[null,null,null,null,null,null,null,null,null,null,null,"Current\nBiennia"]
[null,null,null,2014,2015,2016,2017,2018,2019,2020,2021,2022,2023,2024,2025,2026,2027,2028,2029,2030,2031]
[null,null,"Million Gallons"]
[null,null,"Gasoline (June 2022 Forecast)",2716,2757,2844,2887,2966,2905,2734,2494,2659,2719,2762,2795,2815,2834,2853,2871,2890,2909]
[null,null,"Annual Percentage Change",1.4999999999999999E-2,1.4999999999999999E-2,3.1E-2,1.4999999999999999E-2,2.8000000000000001E-2,-2.1000000000000001E-2,-5.8999999999999997E-2,-8.7999999999999995E-2,6.6000000000000003E-2,2.3E-2,1.6E-2,1.2E-2,7.0000000000000001E-3,7.0000000000000001E-3,7.0000000000000001E-3,6.0000000000000001E-3,7.0000000000000001E-3,6.0000000000000001E-3]
[null,null,"Gasoline (Feb. 2022 Forecast)",2716,2757,2844,2887,2966,2905,2734,2494,2659,2719,2762,2795,2815,2834,2853,2871,2890,2909]
{"$rows_left_out":15}
{"sheet":"Vehicle Stock Forecast","index":23,"n_rows":48,"n_cols":21,"rows_kept":48,"cut":false,"hidden":false,"merged":[]}
[]
[null,"Washington Vehicle Stock Forecast"]
[null,null,null,2014,2015,2016,2017,2018,2019,2020,2021,2022,2023,2024,2025,2026,2027,2028,2029,2030,2031]
[null,"Vehicles paying Basic License Fee ($30)"]
[null,null,"Passenger Car and Cabs",4529669,4707553,4908456,5060804,5187649,5204763,5102400,5519519,5400000,5433159,5548000,5662873,5777753,5891612,5968428,6044049,6120658,6196997]
[null,null,"Motorhomes",65975,66913,68720,69000,68917,67618,64100,74078,71000,71160,71320,71486,71651,71812,71970,72124,72278,72430]
[null,null,"Travel Trailers",126313,132569,142484,149700,159651,162387,160400,194295,190000,190222,190999,192917,194895,196852,198869,200866,202923,204960]
[null,null,"Motorcycles",229822,236384,236134,231400,235531,232369,221400,245409,225000,226125,227256,228392,229534,230682,231835,232994,234159,235330]
{"$rows_left_out":41}
{"sheet":"CNG Vehicle Registrations","index":24,"n_rows":14,"n_cols":6,"rows_kept":14,"cut":false,"hidden":false,"merged":[]}
[]
[null,null,"Washington CNG Vehicle Use Analysis"]
[]
[null,null,"CNG Vehicles"]
[null,null,null,"Weighted Average Fuel Economy (MPGe)","[1]",22.869565217391305]
[null,null,null,"Average Per Capita VMT in Washington (2017)","[2]",8272]
[null,null,null,"Washington Avg. Annual CNG Consumption/Vehicle (GGE)","[3]",361.70342205323198]
[null,null,null,"Total Number of CNG Vehicles","[4]",276]
{"$rows_left_out":7}
{"sheet":"Washington EV Data","index":25,"n_rows":22,"n_cols":32,"rows_kept":22,"cut":false,"hidden":false,"merged":[]}
[]
[null,null,"Washington Electric Vehicle Use Analysis",null,null,null,null,null,null,null,null,null,null,null,null,null,null,null,null,null,null,null,null,"Weighted Average Fuel Economy (Kwh/100 miles)","Average Per Capita VMT in Washington (2017)","Washington Avg. Annual Electricity Consumption/BEV (Kwh)",null,"Weighted Average Fuel Economy (kWh/100 miles)","Weighted Average Fuel Economy (kWh/mile)","Weighted Average Electric Range (Miles)","Weighted Average Electric Range Used (Miles)","Estimated Electricity Use/Year/PHEV"]
[]
[null,null,"Battery Electric Vehicles (BEV)"]
[null,null,null,"Weighted Average Fuel Economy (Kwh/100 miles)","[1]",28.934527561812704]
[null,null,null,"Average Per Capita VMT in Washington (2017)","[2]",8272]
[null,null,null,"Washington Avg. Annual Electricity Consumption (kWh/BEV)","[3]",2393.4641199131502]
[]
{"$rows_left_out":15}
{"sheet":"Propane EIA Data","index":26,"n_rows":14,"n_cols":9,"rows_kept":14,"cut":false,"hidden":false,"merged":[[7,5,7,7],[8,5,8,7]]}
[]
[null,null,"Pacific Transportation Sector Propane Consumption Forecast"]
[null,null,"Fuel Type","Units","Source",2021,2022,2023,2024]
[null,null,"Propane","Quads","[1]",1.155E-3,1.3450000000000001E-3,1.4519999999999999E-3,1.4909999999999999E-3]
[null,null,"Propane","MM Gallons",null,{"$f":"((F4*(10^15))/'Fuel Consumption + Conversions'!$E$17)/1000000","v":12.633996937212864},{"$f":"((G4*(10^15)/'Fuel Consumption + Conversions'!$E$17)/1000000)","v":14.712316779698096},{"$f":"((H4*(10^15)/'Fuel Consumption + Conversions'!$E$17)/1000000)","v":15.882739006781886},{"$f":"((I4*(10^15)/'Fuel Consumption + Conversions'!$E$17)/1000000)","v":16.309341500765697}]
[]
[null,null,"Washington Allocation of Transportation Sector Propane Consumption in the Pacific Region"]
[null,null,"Fuel Type","Units","Source","2014-2019 Consumption Average"]
{"$rows_left_out":6}